Target
Transient receptor potential cation channel subfamily M member 2
Ligand
BDBM50446557
Substrate
Meas. Tech.
ChEMBL_1286614 (CHEMBL3111089)
IC50
100000±n/a nM
Citation
 Moreau, CKirchberger, TSwarbrick, JMBartlett, SJFliegert, RYorgan, TBauche, AHarneit, AGuse, AHPotter, BV Structure-activity relationship of adenosine 5'-diphosphoribose at the transient receptor potential melastatin 2 (TRPM2) channel: rational design of antagonists. J Med Chem 56:10079-102 (2013)  
Target
Name:
Transient receptor potential cation channel subfamily M member 2
Synonyms:
EREG1 KNP3 LTrpC-2 TRPC7 TRPM2_HUMAN | Transient receptor potential channel 7
Type:
PROTEIN
Mol. Mass.:
171218.39
Organism:
Homo sapiens (Human)
Description:
ChEMBL_103516
Residue:
1503
  
Inhibitor
Name:
BDBM50446557
Synonyms:
CHEMBL3110204
Type:
Small organic molecule
Emp. Form.:
C19H23N6O9P
Mol. Mass.:
510.3945
SMILES:
NC(Cc1ccc(cc1)-c1nc2c(N)ncnc2n1[C@@H]1O[C@H](COP(O)(O)=O)[C@@H](O)[C@H]1O)C(O)=O
: