Target
Histone-lysine N-methyltransferase EHMT2
Ligand
BDBM50315537
Substrate
Meas. Tech.
ChEMBL_1294294 (CHEMBL3128971)
IC50
2600±n/a nM
Citation
 Cherblanc, FLChapman, KLReid, JBorg, AJSundriyal, SAlcazar-Fuoli, LBignell, EDemetriades, MSchofield, CJDiMaggio, PABrown, RFuchter, MJ On the histone lysine methyltransferase activity of fungal metabolite chaetocin. J Med Chem 56:8616-25 (2013)  
Target
Name:
Histone-lysine N-methyltransferase EHMT2
Synonyms:
BAT8 EHMT2 G9A Histone-lysine N-methyltransferase EHMT1/EHMT2 KMT1C Protein G9a (G9a)
Type:
Enzyme
Mol. Mass.:
132339.87
Organism:
Homo sapiens (Human)
Description:
Q96KQ7
Residue:
1210
  
Inhibitor
Name:
BDBM50315537
Synonyms:
CHEMBL1089316 | chaetocin
Type:
Small organic molecule
Emp. Form.:
C30H28N6O6S4
Mol. Mass.:
696.84
SMILES:
CN1C(=O)[C@@]23C[C@]4([C@H](Nc5ccccc45)N2C(=O)[C@]1(CO)SS3)[C@]12C[C@]34SS[C@](CO)(N(C)C3=O)C(=O)N4[C@H]1Nc1ccccc21
: