Target
Muscarinic acetylcholine receptor M2
Ligand
BDBM50377964
Substrate
Meas. Tech.
ChEMBL_1362503 (CHEMBL3293104)
Ki
0.680000±n/a nM
Citation
 Yamashita, YTanaka, KAsano, TYamakawa, NKobayashi, DIshihara, THanaya, KShoji, MSugai, TWada, MMashimo, TFukunishi, YMizushima, T Synthesis and biological comparison of enantiomers of mepenzolate bromide, a muscarinic receptor antagonist with bronchodilatory and anti-inflammatory activities. Bioorg Med Chem 22:3488-97 (2014)  
Target
Name:
Muscarinic acetylcholine receptor M2
Synonyms:
ACM2_HUMAN Cholinergic, muscarinic M2 Muscarinic acetylcholine receptor M2 and M5 | RecName: Full=Muscarinic acetylcholine receptor M2
Type:
GPCR
Mol. Mass.:
51730.61
Organism:
Homo sapiens (Human)
Description:
P08172
Residue:
466
  
Inhibitor
Name:
BDBM50377964
Synonyms:
Cantil MEPENZOLATE BROMIDE | Mepenzolate
Type:
Small organic molecule
Emp. Form.:
C21H26NO3
Mol. Mass.:
340.4355
SMILES:
C[N+]1(C)CCCC(C1)OC(=O)C(O)(c1ccccc1)c1ccccc1
: