Target
Malate dehydrogenase
Ligand
BDBM50044973
Substrate
Meas. Tech.
ChEMBL_1448377 (CHEMBL3376861)
IC50
700±n/a nM
Citation
 Zinglé, CTritsch, DGrosdemange-Billiard, CRohmer, M Catechol-rhodanine derivatives: Specific and promiscuous inhibitors of Escherichia coli deoxyxylulose phosphate reductoisomerase (DXR). Bioorg Med Chem 22:3713-9 (2014)  
Target
Name:
Malate dehydrogenase
Synonyms:
MDH_THETH | mdh
Type:
PROTEIN
Mol. Mass.:
35423.44
Organism:
Thermus thermophilus
Description:
ChEMBL_1448377
Residue:
327
  
Inhibitor
Name:
BDBM50044973
Synonyms:
CHEMBL3309761
Type:
Small organic molecule
Emp. Form.:
C24H17ClN2O5S2
Mol. Mass.:
512.985
SMILES:
Oc1cccc(\C=C2/SC(=S)N(CC(=O)Nc3ccc(Oc4ccc(Cl)cc4)cc3)C2=O)c1O
: