Target
Integrase
Ligand
BDBM50076169
Substrate
Meas. Tech.
ChEMBL_1473839 (CHEMBL3418916)
IC50
19±n/a nM
Citation
 Cuzzucoli Crucitti, GMétifiot, MPescatori, LMessore, AMadia, VNPupo, GSaccoliti, FScipione, LTortorella, SEsposito, FCorona, ACadeddu, MMarchand, CPommier, YTramontano, ECosti, RDi Santo, R Structure-activity relationship of pyrrolyl diketo acid derivatives as dual inhibitors of HIV-1 integrase and reverse transcriptase ribonuclease H domain. J Med Chem 58:1915-28 (2015)  
Target
Name:
Integrase
Synonyms:
pol
Type:
PROTEIN
Mol. Mass.:
32203.43
Organism:
Human immunodeficiency virus 1
Description:
ChEMBL_106649
Residue:
288
  
Inhibitor
Name:
BDBM50076169
Synonyms:
CHEMBL3415853
Type:
Small organic molecule
Emp. Form.:
C21H16FNO4
Mol. Mass.:
365.3544
SMILES:
OC(=O)C(\O)=C\C(=O)c1cc(cn1Cc1ccc(F)cc1)-c1ccccc1
: