Target
Histamine H1 receptor
Ligand
BDBM22874
Substrate
Meas. Tech.
ChEMBL_1474741 (CHEMBL3424159)
IC50
15±n/a nM
Citation
 Rankovic, Z CNS drug design: balancing physicochemical properties for optimal brain exposure. J Med Chem 58:2584-608 (2015)  
Target
Name:
Histamine H1 receptor
Synonyms:
H1R HISTAMINE H1 HRH1_HUMAN
Type:
G Protein-Coupled Receptor (GPCR)
Mol. Mass.:
55808.72
Organism:
Homo sapiens (Human)
Description:
Cell pellets from SK-N-MC cells transfected with human H1 receptor were used in binding assay.
Residue:
487
  
Inhibitor
Name:
BDBM22874
Synonyms:
2-(4-{1-hydroxy-4-[4-(hydroxydiphenylmethyl)piperidin-1-yl]butyl}phenyl)-2-methylpropanoic acid Allegra Fexofenadine | MDL-16455
Type:
Small organic molecule
Emp. Form.:
C32H39NO4
Mol. Mass.:
501.6564
SMILES:
CC(C)(C(O)=O)c1ccc(cc1)C(O)CCCN1CCC(CC1)C(O)(c1ccccc1)c1ccccc1
: