Target
Aldo-keto reductase family 1 member B1
Ligand
BDBM50080466
Substrate
Meas. Tech.
ChEMBL_1475201 (CHEMBL3424956)
IC50
2188±n/a nM
Citation
 Stefek, MSoltesova Prnova, MMajekova, MRechlin, CHeine, AKlebe, G Identification of novel aldose reductase inhibitors based on carboxymethylated mercaptotriazinoindole scaffold. J Med Chem 58:2649-57 (2015)  
Target
Name:
Aldo-keto reductase family 1 member B1
Synonyms:
ALDR_RAT Akr1b4 Aldr1
Type:
PROTEIN
Mol. Mass.:
35797.87
Organism:
Rattus norvegicus
Description:
ChEMBL_1512484
Residue:
316
  
Inhibitor
Name:
BDBM50080466
Synonyms:
CHEMBL3422330
Type:
Small organic molecule
Emp. Form.:
C17H11FN4O2S
Mol. Mass.:
354.358
SMILES:
OC(=O)Cn1c2ccccc2c2nnc(Sc3ccccc3F)nc12
: