Target
D(2) dopamine receptor
Ligand
BDBM50083509
Substrate
Meas. Tech.
ChEMBL_1474458 (CHEMBL3423747)
Kd
7000±n/a nM
Citation
 Molero, AVendrell, MBonaventura, JZachmann, JLópez, LPardo, LLluis, CCortés, AAlbericio, FCasadó, VRoyo, M A solid-phase combinatorial approach for indoloquinolizidine-peptides with high affinity at D(1) and D(2) dopamine receptors. Eur J Med Chem 97:173-80 (2015)  
Target
Name:
D(2) dopamine receptor
Synonyms:
D(2) dopamine receptor DOPAMINE D2 Long DRD2 Dopamine D2 receptor Dopamine D2 receptor (D2R) Dopamine2-like | d2
Type:
Cell-surface receptors
Mol. Mass.:
50647.10
Organism:
Homo sapiens (Human)
Description:
P14416
Residue:
443
  
Inhibitor
Name:
BDBM50083509
Synonyms:
CHEMBL3423402
Type:
Small organic molecule
Emp. Form.:
C44H59N9O5
Mol. Mass.:
793.9966
SMILES:
[H][C@]12CC[C@@H](CN1CCc1c2[nH]c2ccccc12)C(=O)NCCCCCC(=O)N1CCC[C@H]1C(=O)N[C@@H](Cc1c[nH]c2ccccc12)C(=O)N[C@@H](CCCCN)C(N)=O
: