Target
Potassium voltage-gated channel subfamily E/KQT member 1
Ligand
BDBM50061306
Substrate
Meas. Tech.
ChEMBL_1478593 (CHEMBL3430494)
IC50
79433±n/a nM
Citation
 Mirams, GRDavies, MRBrough, SJBridgland-Taylor, MHCui, YGavaghan, DJAbi-Gerges, N Prediction of Thorough QT study results using action potential simulations based on ion channel screens. J Pharmacol Toxicol Methods 70:246-54 (2014)  
Target
Name:
Potassium voltage-gated channel subfamily E/KQT member 1
Synonyms:
Voltage-gated potassium channel beta subunit Mink/subunit Kv7.1 | Voltage-gated potassium channel, IKs; KCNQ1(Kv7.1)/KCNE1(MinK)
Type:
Mol. Mass.:
Description:
ASSAY_ID of EBI is 158552
Components:
This complex has 2 components.
Component 1
Name:
Potassium voltage-gated channel subfamily E member 1
Synonyms:
Delayed rectifier potassium channel subunit IsK KCNE1 KCNQ1(Kv7.1)/KCNE1(MinK) Voltage-gated potassium channel beta subunit Mink | Voltage-gated potassium channel, IKs
Type:
PROTEIN
Mol. Mass.:
14676.11
Organism:
Homo sapiens (Human)
Description:
ChEMBL_1456351
Residue:
129
  
Component 2
Name:
Potassium voltage-gated channel subfamily KQT member 1
Synonyms:
KCNA8 KCNQ (Kv7) potassium channel KCNQ1_HUMAN Voltage-gated potassium channel subunit Kv7.1 | Voltage-gated potassium channel subunit Kv7.1/Misshapen-like kinase 1
Type:
PROTEIN
Mol. Mass.:
74739.00
Organism:
Homo sapiens (Human)
Description:
ChEMBL_1454245
Residue:
676
  
Inhibitor
Name:
BDBM50061306
Synonyms:
(3S,4aS,8aS)-2-[(2R,3R)-2-Hydroxy-3-(3-hydroxy-2-methyl-benzoylamino)-4-phenylsulfanyl-butyl]-decahydro-isoquinoline-3-carboxylic acid tert-butylamide; compound with methanesulfonic acid CHEMBL1205 Nelfinavir cmdc.202100576, 24h
Type:
Small organic molecule
Emp. Form.:
C32H45N3O4S
Mol. Mass.:
567.782
SMILES:
Cc1c(O)cccc1C(=O)N[C@@H](CSc1ccccc1)[C@H](O)CN1C[C@H]2CCCC[C@H]2C[C@H]1C(=O)NC(C)(C)C
: