Target
Potassium voltage-gated channel subfamily H member 2
Ligand
BDBM50300204
Substrate
Meas. Tech.
ChEMBL_1478862 (CHEMBL3430334)
IC50
50118723±n/a nM
Citation
 Mirams, GRDavies, MRBrough, SJBridgland-Taylor, MHCui, YGavaghan, DJAbi-Gerges, N Prediction of Thorough QT study results using action potential simulations based on ion channel screens. J Pharmacol Toxicol Methods 70:246-54 (2014)  
Target
Name:
Potassium voltage-gated channel subfamily H member 2
Synonyms:
1,3-beta-glucan synthase component GLS2 ERG Eag-related protein 1 Ether-a-go-go-related gene (HERG) Ether-a-go-go-related gene potassium channel 1 Ether-a-go-go-related gene potassium channel 1 (hERG1) Ether-a-go-go-related protein 1 H-ERG KCNH2 Potassium voltage-gated channel subfamily H member 2 (hERG) Voltage-gated potassium channel subunit Kv11.1 hERG Potassium Channel 1 | putative potassium channel subunit
Type:
Multi-pass membrane protein
Mol. Mass.:
126672.65
Organism:
Homo sapiens (Human)
Description:
Q12809
Residue:
1159
  
Inhibitor
Name:
BDBM50300204
Synonyms:
(2R)-2-acetylamino-N-benzyl-3-methoxypropanamide (R)-2-acetamido-N-benzyl-3-methoxypropanamide (R)-N-benzyl 2-acetamido-3-methoxypropionamide, Erlosamide | LACOSAMIDE
Type:
Small organic molecule
Emp. Form.:
C13H18N2O3
Mol. Mass.:
250.2936
SMILES:
COC[C@@H](NC(C)=O)C(=O)NCc1ccccc1
: