Target
Protein arginine N-methyltransferase 1 [11-371]
Ligand
BDBM50095357
Substrate
Meas. Tech.
ChEMBL_1504110 (CHEMBL3591484)
IC50
7.0±n/a nM
Citation
 Mitchell, LHDrew, AERibich, SARioux, NSwinger, KKJacques, SLLingaraj, TBoriack-Sjodin, PAWaters, NJWigle, TJMoradei, OJin, LRiera, TPorter-Scott, MMoyer, MPSmith, JJChesworth, RCopeland, RA Aryl Pyrazoles as Potent Inhibitors of Arginine Methyltransferases: Identification of the First PRMT6 Tool Compound. ACS Med Chem Lett 6:655-9 (2015)  
Target
Name:
Protein arginine N-methyltransferase 1 [11-371]
Synonyms:
ANM1_HUMAN HRMT1L2 PRMT1 Protein arginine methyltransferase 1 (PRMT1) | Protein-arginine N-methyltransferase 1
Type:
Protein
Mol. Mass.:
41506.52
Organism:
Homo sapiens (Human)
Description:
Q99873[11-371]
Residue:
361
  
Inhibitor
Name:
BDBM50095357
Synonyms:
CHEMBL3589027
Type:
Small organic molecule
Emp. Form.:
C17H26N4O
Mol. Mass.:
302.4145
SMILES:
CNCCN(C)Cc1cn[nH]c1-c1ccc(OC(C)C)cc1
: