Target
Polyunsaturated fatty acid lipoxygenase ALOX15
Ligand
BDBM50105864
Substrate
Meas. Tech.
ChEMBL_1507783 (CHEMBL3598540)
IC50
85±n/a nM
Citation
 Pelcman, BSanin, ANilsson, PSchaal, WOlofsson, KKrog-Jensen, CForsell, PHallberg, ALarhed, MBoesen, TKromann, HClaesson, HE N-Substituted pyrazole-3-carboxamides as inhibitors of human 15-lipoxygenase. Bioorg Med Chem Lett 25:3017-23 (2015)  
Target
Name:
Polyunsaturated fatty acid lipoxygenase ALOX15
Synonyms:
15-Lipoxygenase-1 (15-LOX-1) Arachidonate 15-lipoxygenase LOG15 Reticulocyte 15-lipoxygenase-1 | Sphingosine 1-phosphate receptor 1 (S1P1)
Type:
Protein
Mol. Mass.:
74804.05
Organism:
Homo sapiens (Human)
Description:
Residue:
662
  
Inhibitor
Name:
BDBM50105864
Synonyms:
CHEMBL3597775
Type:
Small organic molecule
Emp. Form.:
C18H22ClFN4O2
Mol. Mass.:
380.844
SMILES:
CCCCCCNC(=O)n1nc(cc1C)C(=O)Nc1ccc(F)cc1Cl
: