Target
Hepatocyte growth factor receptor
Ligand
BDBM50115202
Substrate
Meas. Tech.
ChEMBL_1513740 (CHEMBL3610850)
IC50
7.0±n/a nM
Citation
 Raeppel, FRaeppel, SLTherrien, E Design, synthesis and RON receptor tyrosine kinase inhibitory activity of new head groups analogs of LCRF-0004. Bioorg Med Chem Lett 25:3810-5 (2015)  
Target
Name:
Hepatocyte growth factor receptor
Synonyms:
Hepatocyte growth factor receptor Hepatocyte growth factor receptor (c-MET) MET Met proto-oncogene (hepatocyte growth factor receptor) Tyrosine-protein kinase Met (c-Met) c-Met kinase
Type:
Protein
Mol. Mass.:
155559.73
Organism:
Homo sapiens (Human)
Description:
P08581
Residue:
1390
  
Inhibitor
Name:
BDBM50115202
Synonyms:
CHEMBL3608550
Type:
Small organic molecule
Emp. Form.:
C34H25FN6O3S
Mol. Mass.:
616.664
SMILES:
COc1cccc(c1)-c1c(cnn1-c1ccccc1)C(=O)Nc1ccc(Oc2ccnc3cc(sc23)-c2cn(C)cn2)c(F)c1
: