Target
DNA ligase
Ligand
BDBM50131457
Substrate
Meas. Tech.
ChEBML_1526866
IC50
1440±n/a nM
Citation
 Murphy-Benenato, KEGingipalli, LBoriack-Sjodin, PAMartinez-Botella, GCarcanague, DEyermann, CJGowravaram, MHarang, JHale, MRIoannidis, GJahic, HJohnstone, MKutschke, ALaganas, VALoch, JTMiller, MDOguto, HPatel, SJ Negishi cross-coupling enabled synthesis of novel NAD(+)-dependent DNA ligase inhibitors and SAR development. Bioorg Med Chem Lett 25:5172-7 (2015)  
Target
Name:
DNA ligase
Synonyms:
DNLJ_STAAU lig | ligA
Type:
PROTEIN
Mol. Mass.:
75059.93
Organism:
Staphylococcus aureus
Description:
ChEMBL_1281598
Residue:
667
  
Inhibitor
Name:
BDBM50131457
Synonyms:
CHEMBL3632784
Type:
Small organic molecule
Emp. Form.:
C16H16N8
Mol. Mass.:
320.3518
SMILES:
CC(C)(C)c1nc(-c2cnccn2)c2c(N)c(C#N)c(N)nc2n1
: