Target
Tyrosine-protein kinase JAK1
Ligand
BDBM50135127
Substrate
Meas. Tech.
ChEMBL_1545251 (CHEMBL3751001)
IC50
9.0±n/a nM
Citation
 Vasbinder, MMAlimzhanov, MAugustin, MBebernitz, GBell, KChuaqui, CDeegan, TFerguson, ADGoodwin, KHuszar, DKawatkar, AKawatkar, SRead, JShi, JSteinbacher, SSteuber, HSu, QToader, DWang, HWoessner, RWu, AYe, MZinda, M Identification of azabenzimidazoles as potent JAK1 selective inhibitors. Bioorg Med Chem Lett 26:60-7 (2015)  
Target
Name:
Tyrosine-protein kinase JAK1
Synonyms:
JAK-1 JAK1A JAK1_HUMAN Janus kinase 1 (JAK1) | Janus kinase 1 JAK1
Type:
Protein
Mol. Mass.:
133293.73
Organism:
Homo sapiens (Human)
Description:
P23458
Residue:
1154
  
Inhibitor
Name:
BDBM50135127
Synonyms:
CHEMBL3746766
Type:
Small organic molecule
Emp. Form.:
C20H24ClN5O
Mol. Mass.:
385.89
SMILES:
COc1ccc(-c2nc3c(NCC4CCNCC4)c(Cl)cnc3[nH]2)c(C)c1
: