Target
Prostaglandin G/H synthase 1
Ligand
BDBM50153352
Substrate
Meas. Tech.
ChEMBL_1562612 (CHEMBL3779261)
IC50
9.0±n/a nM
Citation
 Migliore, MHabrant, DSasso, OAlbani, CBertozzi, SMArmirotti, APiomelli, DScarpelli, R Potent multitarget FAAH-COX inhibitors: Design and structure-activity relationship studies. Eur J Med Chem 109:216-37 (2016)  
Target
Name:
Prostaglandin G/H synthase 1
Synonyms:
COX1 Cyclooxygenase-1 (COX-1) PTGS1 | Prostaglandin G/H synthase (cyclooxygenase)
Type:
Protein
Mol. Mass.:
68868.60
Organism:
Ovis aries (Sheep)
Description:
Residue:
600
  
Inhibitor
Name:
BDBM50153352
Synonyms:
CHEMBL3774941
Type:
Small organic molecule
Emp. Form.:
C22H26ClNO4
Mol. Mass.:
403.899
SMILES:
CCCCCCNC(=O)Oc1cccc(c1)-c1ccc(cc1Cl)C(C)C(O)=O
: