Target
Large neutral amino acids transporter small subunit 1
Ligand
BDBM50174344
Substrate
Meas. Tech.
ChEMBL_1579725 (CHEMBL3811918)
IC50
6600±n/a nM
Citation
 Augustyn, EFinke, KZur, AAHansen, LHeeren, NChien, HCLin, LGiacomini, KMColas, CSchlessinger, AThomas, AA LAT-1 activity of meta-substituted phenylalanine and tyrosine analogs. Bioorg Med Chem Lett 26:2616-2621 (2016)  
Target
Name:
Large neutral amino acids transporter small subunit 1
Synonyms:
4F2 LC 4F2LC CD98LC Integral membrane protein E16 LAT1 Large neutral amino acids transporter small subunit 1 SLC7A5 hLAT1 | y+ system cationic amino acid transporter
Type:
PROTEIN
Mol. Mass.:
55013.61
Organism:
Homo sapiens (Human)
Description:
ChEMBL_100160
Residue:
507
  
Inhibitor
Name:
BDBM50174344
Synonyms:
CHEMBL58129
Type:
Small organic molecule
Emp. Form.:
C15H15NO2
Mol. Mass.:
241.2851
SMILES:
N[C@@H](Cc1cccc(c1)-c1ccccc1)C(O)=O
: