Target
Type-1 angiotensin II receptor
Ligand
BDBM82258
Substrate
Meas. Tech.
ChEMBL_1590360 (CHEMBL3830508)
IC50
3.2±n/a nM
Citation
 Kritsi, EMatsoukas, MTPotamitis, CKarageorgos, VDetsi, AMagafa, VLiapakis, GMavromoustakos, TZoumpoulakis, P Exploring new scaffolds for angiotensin II receptor antagonism. Bioorg Med Chem 24:4444-4451 (2016)  
Target
Name:
Type-1 angiotensin II receptor
Synonyms:
AGTR1 AGTR1B AT1 AT1BR AT2R1B Angiotensin II receptor Type-1 angiotensin II receptor (AT1)
Type:
Protein
Mol. Mass.:
41080.75
Organism:
Homo sapiens (Human)
Description:
P30556
Residue:
359
  
Inhibitor
Name:
BDBM82258
Synonyms:
CAS_114798-26-4 NSC_3961
Type:
Small organic molecule
Emp. Form.:
C22H23ClN6O
Mol. Mass.:
422.911
SMILES:
CCCCc1nc(Cl)c(CO)n1Cc1ccc(cc1)-c1ccccc1-c1nnn[nH]1
: