Target
Cytochrome P450 3A4
Ligand
BDBM50192914
Substrate
Meas. Tech.
ChEMBL_1614025 (CHEMBL3855825)
IC50
9900±n/a nM
Citation
 Couturier, CLair, CPellet, AUpton, AKaneko, TPerron, CCogo, EMenegotto, JBauer, AScheiper, BLagrange, SBacqué, E Identification and optimization of a new series of anti-tubercular quinazolinones. Bioorg Med Chem Lett 26:5290-5299 (2016)  
Target
Name:
Cytochrome P450 3A4
Synonyms:
Albendazole monooxygenase CP3A4_HUMAN CYP3A4 CYPIIIA4 Cytochrome P450 3A4 (CYP3A4) Nifedipine oxidase Taurochenodeoxycholate 6-alpha-hydroxylase
Type:
Enzyme
Mol. Mass.:
57349.57
Organism:
Homo sapiens (Human)
Description:
Residue:
503
  
Inhibitor
Name:
BDBM50192914
Synonyms:
CHEMBL3957699
Type:
Small organic molecule
Emp. Form.:
C21H17ClFN5O
Mol. Mass.:
409.844
SMILES:
Cn1c(NCCc2ccc(cc2)-c2ncc(F)cn2)nc2cc(Cl)ccc2c1=O
: