Target
Nuclear receptor ROR-gamma
Ligand
BDBM50203462
Substrate
Meas. Tech.
ChEMBL_1625739 (CHEMBL3868208)
IC50
40±n/a nM
Citation
 Ouvry, GBouix-Peter, CCiesielski, FChantalat, LChristin, OComino, CDuvert, DFeret, CHarris, CSLamy, LLuzy, APMusicki, BOrfila, DPascau, JParnet, VPerrin, APierre, RPolge, GRaffin, CRival, YTaquet, NThoreau, EHennequin, LF Discovery of phenoxyindazoles and phenylthioindazoles as ROR¿ inverse agonists. Bioorg Med Chem Lett 26:5802-5808 (2016)  
Target
Name:
Nuclear receptor ROR-gamma
Synonyms:
NR1F3 Nuclear receptor ROR-gamma (RORC) RAR-related orphan receptor C (RORc) RORG RZRG Retinoid-related orphan receptor-gamma (RORc)
Type:
Enzyme Catalytic Domain
Mol. Mass.:
58218.40
Organism:
Homo sapiens (Human)
Description:
P51449
Residue:
518
  
Inhibitor
Name:
BDBM50203462
Synonyms:
CHEMBL3931161
Type:
Small organic molecule
Emp. Form.:
C24H17ClF3N3O4
Mol. Mass.:
503.858
SMILES:
CN(C)C(=O)c1ccc2n(nc(Oc3c(Cl)cccc3C(F)(F)F)c2c1)-c1ccc(cc1)C(O)=O
: