Target
Retinoic acid receptor gamma
Ligand
BDBM50203542
Substrate
Meas. Tech.
ChEMBL_1625735 (CHEMBL3868204)
IC50
1300±n/a nM
Citation
 Ouvry, GBouix-Peter, CCiesielski, FChantalat, LChristin, OComino, CDuvert, DFeret, CHarris, CSLamy, LLuzy, APMusicki, BOrfila, DPascau, JParnet, VPerrin, APierre, RPolge, GRaffin, CRival, YTaquet, NThoreau, EHennequin, LF Discovery of phenoxyindazoles and phenylthioindazoles as ROR¿ inverse agonists. Bioorg Med Chem Lett 26:5802-5808 (2016)  
Target
Name:
Retinoic acid receptor gamma
Synonyms:
NR1B3 RAR-gamma RARG_HUMAN Retinoic acid receptor gamma | Retinoid receptor
Type:
PROTEIN
Mol. Mass.:
50345.43
Organism:
Homo sapiens (Human)
Description:
ChEMBL_1458016
Residue:
454
  
Inhibitor
Name:
BDBM50203542
Synonyms:
CHEMBL3218921
Type:
Small organic molecule
Emp. Form.:
C21H12Cl2N2O3
Mol. Mass.:
411.238
SMILES:
OC(=O)c1ccc(cc1)-c1nn(C(=O)c2c(Cl)cccc2Cl)c2ccccc12
: