Target
Nuclear receptor ROR-gamma
Ligand
BDBM50203542
Substrate
Meas. Tech.
ChEMBL_1625734 (CHEMBL3868203)
IC50
60±n/a nM
Citation
 Ouvry, GBouix-Peter, CCiesielski, FChantalat, LChristin, OComino, CDuvert, DFeret, CHarris, CSLamy, LLuzy, APMusicki, BOrfila, DPascau, JParnet, VPerrin, APierre, RPolge, GRaffin, CRival, YTaquet, NThoreau, EHennequin, LF Discovery of phenoxyindazoles and phenylthioindazoles as ROR¿ inverse agonists. Bioorg Med Chem Lett 26:5802-5808 (2016)  
Target
Name:
Nuclear receptor ROR-gamma
Synonyms:
NR1F3 Nuclear receptor ROR-gamma (RORC) RAR-related orphan receptor C (RORc) RORG RZRG Retinoid-related orphan receptor-gamma (RORc)
Type:
Enzyme Catalytic Domain
Mol. Mass.:
58218.40
Organism:
Homo sapiens (Human)
Description:
P51449
Residue:
518
  
Inhibitor
Name:
BDBM50203542
Synonyms:
CHEMBL3218921
Type:
Small organic molecule
Emp. Form.:
C21H12Cl2N2O3
Mol. Mass.:
411.238
SMILES:
OC(=O)c1ccc(cc1)-c1nn(C(=O)c2c(Cl)cccc2Cl)c2ccccc12
: