Target
Amine oxidase [flavin-containing] B
Ligand
BDBM50172756
Substrate
Meas. Tech.
ChEMBL_1629362 (CHEMBL3871988)
IC50
195±n/a nM
Citation
 Ko?ak, UKnez, DCoquelle, NBrus, BPi?lar, ANachon, FBrazzolotto, XKos, JColletier, JPGobec, S N-Propargylpiperidines with naphthalene-2-carboxamide or naphthalene-2-sulfonamide moieties: Potential multifunctional anti-Alzheimer's agents. Bioorg Med Chem 25:633-645 (2017)  
Target
Name:
Amine oxidase [flavin-containing] B
Synonyms:
AOFB_HUMAN MAOB Monoamine oxidase type B (MAO B) Monoamine oxidase type B (MAOB)
Type:
Protein
Mol. Mass.:
58768.76
Organism:
Homo sapiens (Human)
Description:
P27338
Residue:
520
  
Inhibitor
Name:
BDBM50172756
Synonyms:
Benzyl-methyl-prop-2-ynyl-amine Eutonyl N-benzyl-N-methylprop-2-yn-1-amine US9603833, Pargyline
Type:
Small organic molecule
Emp. Form.:
C11H13N
Mol. Mass.:
159.2276
SMILES:
CN(CC#C)Cc1ccccc1
: