Target
D(3) dopamine receptor
Ligand
BDBM50206981
Substrate
Meas. Tech.
ChEMBL_1629511 (CHEMBL3872137)
Ki
251±n/a nM
Citation
 Saavedra, OMKarila, DBrossard, DRojas, ADupuis, DGohier, AMannoury la Cour, CMillan, MJOrtuno, JCHanessian, S Design and synthesis of novel N-sulfonyl-2-indoles that behave as 5-HT Bioorg Med Chem 25:38-52 (2017)  
Target
Name:
D(3) dopamine receptor
Synonyms:
DOPAMINE D3 DRD3_HUMAN Dopamine D3 receptor (D3) Dopamine receptor Dopamine receptor D3
Type:
Mol. Mass.:
44243.43
Organism:
Homo sapiens (Human)
Description:
Residue:
400
  
Inhibitor
Name:
BDBM50206981
Synonyms:
CHEMBL3948819
Type:
Small organic molecule
Emp. Form.:
C22H20N2O2S
Mol. Mass.:
376.471
SMILES:
CNCC1Cc2ccc3n(ccc3c12)S(=O)(=O)c1cccc2ccccc12
: