Target
5-hydroxytryptamine receptor 6
Ligand
BDBM50207040
Substrate
Meas. Tech.
ChEMBL_1629512 (CHEMBL3872138)
Ki
158±n/a nM
Citation
 Saavedra, OMKarila, DBrossard, DRojas, ADupuis, DGohier, AMannoury la Cour, CMillan, MJOrtuno, JCHanessian, S Design and synthesis of novel N-sulfonyl-2-indoles that behave as 5-HT Bioorg Med Chem 25:38-52 (2017)  
Target
Name:
5-hydroxytryptamine receptor 6
Synonyms:
5-HT-6 5-hydroxytryptamine receptor 6 (5-HT-6) 5-hydroxytryptamine receptor 6 (5HT6) HTR6 Serotonin 6 (5-HT6) receptor | Serotonin Receptor 6
Type:
G Protein-Coupled Receptor (GPCR)
Mol. Mass.:
46968.43
Organism:
Homo sapiens (Human)
Description:
P50406
Residue:
440
  
Inhibitor
Name:
BDBM50207040
Synonyms:
CHEMBL3963688
Type:
Small organic molecule
Emp. Form.:
C19H20N2O3S
Mol. Mass.:
356.439
SMILES:
CN[C@@H]1[C@@H](CCO)c2cc3ccn(c3cc12)S(=O)(=O)c1ccccc1
: