Target
Tyrosine-protein kinase ABL1
Ligand
BDBM50211225
Substrate
Meas. Tech.
ChEMBL_1636079 (CHEMBL3878977)
IC50
6.0±n/a nM
Citation
 Wang, QLiu, FWang, BZou, FQi, ZChen, CYu, KHu, CQi, SWang, WHu, ZLiu, JWang, WWang, LLiang, QZhang, SRen, TLiu, QLiu, J Discovery of 4-Methyl-N-(4-((4-methylpiperazin-1-yl)methyl)-3-(trifluoromethyl)phenyl)-3-((1-nicotinoylpiperidin-4-yl)oxy)benzamide (CHMFL-ABL/KIT-155) as a Novel Highly Potent Type II ABL/KIT Dual Kinase Inhibitor with a Distinct Hinge Binding. J Med Chem 60:273-289 (2017)  
Target
Name:
Tyrosine-protein kinase ABL1
Synonyms:
ABL ABL1_HUMAN JTK7 Proto-oncogene tyrosine-protein kinase ABL1 Tyrosine-protein kinase ABL V-abl Abelson murine leukemia viral oncogene homolog 1 p150 | tyrosine-protein kinase ABL1 isoform a
Type:
Enzyme
Mol. Mass.:
122897.30
Organism:
Homo sapiens (Human)
Description:
P00519
Residue:
1130
  
Inhibitor
Name:
BDBM50211225
Synonyms:
CHEMBL3957831
Type:
Small organic molecule
Emp. Form.:
C33H38F3N5O3
Mol. Mass.:
609.6817
SMILES:
CN1CCN(Cc2ccc(cc2C(F)(F)F)C(=O)Nc2ccc(C)c(OC3CCN(CC3)C(=O)c3cncc(C)c3)c2)CC1
: