Target
Diacylglycerol lipase-alpha
Ligand
BDBM50211236
Substrate
Meas. Tech.
ChEMBL_1636270 (CHEMBL3879168)
IC50
126±n/a nM
Citation
 Deng, HKooijman, Svan den Nieuwendijk, AMOgasawara, Dvan der Wel, Tvan Dalen, FBaggelaar, MPJanssen, FJvan den Berg, RJden Dulk, HCravatt, BFOverkleeft, HSRensen, PCvan der Stelt, M Triazole Ureas Act as Diacylglycerol Lipase Inhibitors and Prevent Fasting-Induced Refeeding. J Med Chem 60:428-440 (2017)  
Target
Name:
Diacylglycerol lipase-alpha
Synonyms:
C11orf11 DGLA_HUMAN NSDDR | Sn1-specific diacylglycerol lipase alpha
Type:
PROTEIN
Mol. Mass.:
114947.74
Organism:
Homo sapiens (Human)
Description:
ChEMBL_1449471
Residue:
1042
  
Inhibitor
Name:
BDBM50211236
Synonyms:
CHEMBL2144065
Type:
Small organic molecule
Emp. Form.:
C27H26N4O
Mol. Mass.:
422.5215
SMILES:
O=C(N1CCCCC1Cc1ccccc1)n1cc(nn1)-c1ccc(cc1)-c1ccccc1
: