Target
Diacylglycerol lipase-alpha
Ligand
BDBM50211264
Substrate
Meas. Tech.
ChEBML_1636270
IC50
20±n/a nM
Citation
 Deng, HKooijman, Svan den Nieuwendijk, AMOgasawara, Dvan der Wel, Tvan Dalen, FBaggelaar, MPJanssen, FJvan den Berg, RJden Dulk, HCravatt, BFOverkleeft, HSRensen, PCvan der Stelt, M Triazole Ureas Act as Diacylglycerol Lipase Inhibitors and Prevent Fasting-Induced Refeeding. J Med Chem 60:428-440 (2017)  
Target
Name:
Diacylglycerol lipase-alpha
Synonyms:
C11orf11 DGLA_HUMAN NSDDR | Sn1-specific diacylglycerol lipase alpha
Type:
PROTEIN
Mol. Mass.:
114947.74
Organism:
Homo sapiens (Human)
Description:
ChEMBL_1449471
Residue:
1042
  
Inhibitor
Name:
BDBM50211264
Synonyms:
CHEMBL3966016
Type:
Small organic molecule
Emp. Form.:
C22H24N4O
Mol. Mass.:
360.4522
SMILES:
CCC1CCCCN1C(=O)n1cc(nn1)-c1ccc(cc1)-c1ccccc1
: