Target
Diacylglycerol lipase-alpha
Ligand
BDBM50211240
Substrate
Meas. Tech.
ChEBML_1636271
IC50
2.0±n/a nM
Citation
 Deng, HKooijman, Svan den Nieuwendijk, AMOgasawara, Dvan der Wel, Tvan Dalen, FBaggelaar, MPJanssen, FJvan den Berg, RJden Dulk, HCravatt, BFOverkleeft, HSRensen, PCvan der Stelt, M Triazole Ureas Act as Diacylglycerol Lipase Inhibitors and Prevent Fasting-Induced Refeeding. J Med Chem 60:428-440 (2017)  
Target
Name:
Diacylglycerol lipase-alpha
Synonyms:
DGL-alpha Dagla Neural stem cell-derived dendrite regulator Sn1-specific diacylglycerol lipase alpha
Type:
PROTEIN
Mol. Mass.:
115371.22
Organism:
Mus musculus
Description:
ChEMBL_101098
Residue:
1044
  
Inhibitor
Name:
BDBM50211240
Synonyms:
CHEMBL3897587
Type:
Small organic molecule
Emp. Form.:
C32H32F2N4O3
Mol. Mass.:
558.6183
SMILES:
OC(c1cnn(n1)C(=O)N1C[C@@H](CC[C@@H]1Cc1ccccc1)OCC1CC1)(c1ccc(F)cc1)c1ccc(F)cc1
: