Target
Alpha-1A adrenergic receptor
Ligand
BDBM50016897
Substrate
Meas. Tech.
ChEMBL_32313 (CHEMBL646167)
Ki
977±n/a nM
Citation
  TBA Bioorg Med Chem Lett 4:2317-2322 (1994)   
Target
Name:
Alpha-1A adrenergic receptor
Synonyms:
ADA1A_HUMAN ADRA1C Alpha 1A-adrenoceptor Alpha adrenergic receptor 1a Alpha-adrenergic receptor 1c adrenergic Alpha1 | adrenergic Alpha1C
Type:
Cell-surface receptors
Mol. Mass.:
51511.67
Organism:
Homo sapiens (Human)
Description:
P35348
Residue:
466
  
Inhibitor
Name:
BDBM50016897
Synonyms:
2-(2,6-dichloroanilino)-1,3-diazacyclopentene-(2) CLONIDINE clonidine (amino form)
Type:
Small organic molecule
Emp. Form.:
C9H9Cl2N3
Mol. Mass.:
230.094
SMILES:
Clc1cccc(Cl)c1\[#7]=[#6]-1\[#7]-[#6]-[#6]-[#7]-1
: