Target
Protein kinase C zeta type
Ligand
BDBM79181
Substrate
Meas. Tech.
ChEMBL_162387 (CHEMBL767475)
IC50
500000±n/a nM
Citation
 Xu, WCZhou, QAshendel, CLChang, CTChang, CJ Novel protein kinase C inhibitors: synthesis and PKC inhibition of beta-substituted polythiophene derivatives. Bioorg Med Chem Lett 9:2279-82 (1999)  
Target
Name:
Protein kinase C zeta type
Synonyms:
KPCZ_RAT Prkcz Protein kinase C zeta type | nPKC-zeta
Type:
PROTEIN
Mol. Mass.:
67722.31
Organism:
Rattus norvegicus
Description:
ChEMBL_104731
Residue:
592
  
Inhibitor
Name:
BDBM79181
Synonyms:
10-[3-(4-methyl-1-piperazinyl)propyl]-2-(trifluoromethyl)phenothiazine;hydrochloride 10-[3-(4-methylpiperazino)propyl]-2-(trifluoromethyl)phenothiazine;hydrochloride SMR000059133 TRIFLUOPERAZINE DIHYDROCHLORIDE US11542290, Compound Trifluoperazine cid_5566
Type:
Small organic molecule
Emp. Form.:
C21H24F3N3S
Mol. Mass.:
407.496
SMILES:
CN1CCN(CCCN2c3ccccc3Sc3ccc(cc23)C(F)(F)F)CC1
: