Target
Alpha-galactosidase A
Ligand
BDBM50163440
Substrate
Meas. Tech.
ChEMBL_1653300 (CHEMBL4002666)
IC50
13±n/a nM
Citation
 Cheng, WCWang, JHYun, WYLi, HYHu, JM Rapid preparation of (3R,4S,5R) polyhydroxylated pyrrolidine-based libraries to discover a pharmacological chaperone for treatment of Fabry disease. Eur J Med Chem 126:1-6 (2017)  
Target
Name:
Alpha-galactosidase A
Synonyms:
AGAL_HUMAN Alpha-D-galactoside galactohydrolase Alpha-glucosidase A (α-Gal A) INN=Agalsidase | Melibiase
Type:
Protein
Mol. Mass.:
48760.21
Organism:
Homo sapiens (Human)
Description:
Residue:
429
  
Inhibitor
Name:
BDBM50163440
Synonyms:
(2R,3S,4R,5S)-2-(hydroxymethyl)piperidine-3,4,5-triol 1-deoxygalactonojirimycin D-galacto-1-Deoxynojirimycin | DGJ
Type:
Small organic molecule
Emp. Form.:
C6H13NO4
Mol. Mass.:
163.1717
SMILES:
OC[C@H]1NC[C@H](O)[C@@H](O)[C@H]1O
: