Target
Bile salt export pump
Ligand
BDBM39344
Substrate
Meas. Tech.
ChEMBL_1661982 (CHEMBL4011663)
IC50
>135000±n/a nM
Citation
 Morgan, RETrauner, Mvan Staden, CJLee, PHRamachandran, BEschenberg, MAfshari, CAQualls, CWLightfoot-Dunn, RHamadeh, HK Interference with bile salt export pump function is a susceptibility factor for human liver injury in drug development. Toxicol Sci 118:485-500 (2010)  
Target
Name:
Bile salt export pump
Synonyms:
ABCB11 ATP-binding cassette sub-family B member 11 Bile Salt Export Pump, BSEP Bile salt export pump (BSEP)
Type:
Protein
Mol. Mass.:
146405.49
Organism:
Homo sapiens (Human)
Description:
O95342
Residue:
1321
  
Inhibitor
Name:
BDBM39344
Synonyms:
4-amino-N-[2-(diethylamino)ethyl]benzamide;hydrochloride MLS000069436 PROCAINAMIDE HYDROCHLORIDE cid_66068
Type:
Small organic molecule
Emp. Form.:
C13H21N3O
Mol. Mass.:
235.3253
SMILES:
CCN(CC)CCNC(=O)c1ccc(N)cc1
: