Target
Sodium-dependent dopamine transporter
Ligand
BDBM50041296
Substrate
Ki
2.83±n/a nM
Comments
PDSP_1551
Citation
 Letchworth, SRSmith, HRPorrino, LJBennett, BADavies, HMSexton, TChilders, SR Characterization of a tropane radioligand, [(3)H]2beta-propanoyl-3beta-(4-tolyl) tropane ([(3)H]PTT), for dopamine transport sites in rat brain. J Pharmacol Exp Ther 293:686-96 (2000) Target
Name:
Sodium-dependent dopamine transporter
Synonyms:
DA transporter SC6A3_RAT Sodium-dependent dopamine transporter | Sodium-dependent dopamine transporter (DAT)
Type:
Multi-pass membrane protein
Mol. Mass.:
68749.45
Organism:
Rattus norvegicus (rat)
Description:
P23977
Residue:
619
  
Inhibitor
Name:
BDBM50041296
Synonyms:
1-(8-Methyl-3-p-tolyl-8-aza-bicyclo[3.2.1]oct-2-yl)-propan-1-one PTT(-)
Type:
Small organic molecule
Emp. Form.:
C18H25NO
Mol. Mass.:
271.3972
SMILES:
CCC(=O)C1C2CCC(CC1c1ccc(C)cc1)N2C
: