Target
Delta-type opioid receptor
Ligand
BDBM55532
Substrate
Meas. Tech.
Counterscreen for biased ligands (agonists) of the melanocortin 4 receptor (MC4R)
EC50
>64572±n/a nM
Citation
 PubChem, PC Counterscreen for biased ligands (agonists) of the melanocortin 4 receptor (MC4R): Luminescence-based cell-based high throughput dose response assay to identify agonists of heterodimerization of the mu 1 (OPRM1) and delta 1 (OPRD1) opioid receptors PubChem Bioassay (2012)[AID] 
Target
Name:
Delta-type opioid receptor
Synonyms:
D-OR-1 Delta opioid receptor OPIATE Delta OPRD1 OPRK1 | opioid receptor, delta 1
Type:
G Protein-Coupled Receptor (GPCR)
Mol. Mass.:
40382.98
Organism:
Homo sapiens (Human)
Description:
Competition binding assays were carried out using membrane preparations from transfected HN9.10 cells that constitutively expressed the delta opioid receptor.
Residue:
372
  
Inhibitor
Name:
BDBM55532
Synonyms:
MLS000582933 N-(5-bromo-6-methyl-2-pyridinyl)-3-(2-oxo-1-benzopyran-3-yl)benzamide N-(5-bromo-6-methyl-2-pyridyl)-3-(2-ketochromen-3-yl)benzamide SMR000201639 | cid_1258911
Type:
Small organic molecule
Emp. Form.:
C22H15BrN2O3
Mol. Mass.:
435.27
SMILES:
Cc1nc(NC(=O)c2cccc(c2)-c2cc3ccccc3oc2=O)ccc1Br
: