Target
Delta-type opioid receptor
Ligand
BDBM88451
Substrate
Meas. Tech.
Counterscreen for biased ligands (agonists) of the melanocortin 4 receptor (MC4R)
EC50
>64600±n/a nM
Citation
 PubChem, PC Counterscreen for biased ligands (agonists) of the melanocortin 4 receptor (MC4R): Luminescence-based cell-based high throughput dose response assay to identify agonists of heterodimerization of the mu 1 (OPRM1) and delta 1 (OPRD1) opioid receptors PubChem Bioassay (2012)[AID] 
Target
Name:
Delta-type opioid receptor
Synonyms:
D-OR-1 Delta opioid receptor OPIATE Delta OPRD1 OPRK1 | opioid receptor, delta 1
Type:
G Protein-Coupled Receptor (GPCR)
Mol. Mass.:
40382.98
Organism:
Homo sapiens (Human)
Description:
Competition binding assays were carried out using membrane preparations from transfected HN9.10 cells that constitutively expressed the delta opioid receptor.
Residue:
372
  
Inhibitor
Name:
BDBM88451
Synonyms:
(E)-3-(3,4-Dihydro-2H-benzo[b][1,4]dioxepin-7-yl)-1-(2-hydroxy-5-methyl-phenyl)-propenone (E)-3-(3,4-dihydro-2H-1,5-benzodioxepin-7-yl)-1-(2-hydroxy-5-methylphenyl)-2-propen-1-one (E)-3-(3,4-dihydro-2H-1,5-benzodioxepin-7-yl)-1-(5-methyl-2-oxidanyl-phenyl)prop-2-en-1-one SMR000217530 | cid_5708658
Type:
Small organic molecule
Emp. Form.:
C19H18O4
Mol. Mass.:
310.3438
SMILES:
Cc1ccc(O)c(c1)C(=O)\C=C\c1ccc2OCCCOc2c1
: