Target
Delta-type opioid receptor
Ligand
BDBM37297
Substrate
Meas. Tech.
Counterscreen for biased ligands (agonists) of the melanocortin 4 receptor (MC4R)
EC50
>92441±n/a nM
Citation
 PubChem, PC Counterscreen for biased ligands (agonists) of the melanocortin 4 receptor (MC4R): Luminescence-based cell-based high throughput dose response assay to identify agonists of heterodimerization of the mu 1 (OPRM1) and delta 1 (OPRD1) opioid receptors PubChem Bioassay (2012)[AID] 
Target
Name:
Delta-type opioid receptor
Synonyms:
D-OR-1 Delta opioid receptor OPIATE Delta OPRD1 OPRK1 | opioid receptor, delta 1
Type:
G Protein-Coupled Receptor (GPCR)
Mol. Mass.:
40382.98
Organism:
Homo sapiens (Human)
Description:
Competition binding assays were carried out using membrane preparations from transfected HN9.10 cells that constitutively expressed the delta opioid receptor.
Residue:
372
  
Inhibitor
Name:
BDBM37297
Synonyms:
7-methoxy-N-[1-(4-methylbenzyl)-1H-pyrazol-3-yl]-4,5-dihydronaphtho[2,1-d]isoxazole-3-carboxamide 7-methoxy-N-[1-[(4-methylphenyl)methyl]-3-pyrazolyl]-4,5-dihydrobenzo[g][1,2]benzoxazole-3-carboxamide MLS000087457 cid_3240939
Type:
Small organic molecule
Emp. Form.:
C24H22N4O3
Mol. Mass.:
414.4565
SMILES:
COc1ccc2-c3onc(C(=O)Nc4ccn(Cc5ccc(C)cc5)n4)c3CCc2c1
: