Target
Beta-2-microglobulin
Ligand
BDBM92397
Substrate
Meas. Tech.
Fluorescence Assay
pH
7.4±0
Temperature
310.15±0 K
IC50
4.9e+4± 9e+3 nM
Citation
 Giorgetti, SRaimondi, SPagano, KRelini, ABucciantini, MCorazza, AFogolari, FCodutti, LSalmona, MMangione, PColombo, LDe Luigi, APorcari, RGliozzi, AStefani, MEsposito, GBellotti, VStoppini, M Effect of tetracyclines on the dynamics of formation and destructuration of beta2-microglobulin amyloid fibrils. J Biol Chem 286:2121-31 (2011)  
Target
Name:
Beta-2-microglobulin
Synonyms:
B2M | B2MG_HUMAN
Type:
Enzyme
Mol. Mass.:
13714.40
Organism:
Homo sapiens (Human)
Description:
P61769
Residue:
119
  
Inhibitor
Name:
BDBM92397
Synonyms:
4-epi-oxytetracycline
Type:
Small organic molecule
Emp. Form.:
C22H24N2O9
Mol. Mass.:
460.434
SMILES:
CN(C)[C@@H]1C2C(O)C3C(C(=O)c4c(O)cccc4[C@@]3(C)O)C(=O)[C@]2(O)C(=O)C(C(N)=O)C1=O
: