Target
Beta-2-microglobulin
Ligand
BDBM92398
Substrate
Meas. Tech.
Fluorescence Assay
pH
7.4±0
Temperature
310.15±0 K
IC50
1.36e+5± 1.0e+4 nM
Citation
 Giorgetti, SRaimondi, SPagano, KRelini, ABucciantini, MCorazza, AFogolari, FCodutti, LSalmona, MMangione, PColombo, LDe Luigi, APorcari, RGliozzi, AStefani, MEsposito, GBellotti, VStoppini, M Effect of tetracyclines on the dynamics of formation and destructuration of beta2-microglobulin amyloid fibrils. J Biol Chem 286:2121-31 (2011)  
Target
Name:
Beta-2-microglobulin
Synonyms:
B2M | B2MG_HUMAN
Type:
Enzyme
Mol. Mass.:
13714.40
Organism:
Homo sapiens (Human)
Description:
P61769
Residue:
119
  
Inhibitor
Name:
BDBM92398
Synonyms:
Rolitetracycline
Type:
Small organic molecule
Emp. Form.:
C27H33N3O8
Mol. Mass.:
527.5662
SMILES:
CN(C)[C@H]1[C@@H]2C[C@H]3C(C(=O)c4c(O)cccc4[C@@]3(C)O)C(=O)[C@]2(O)C(=O)C(C(=O)NCN2CCCC2)C1=O
: