Target
Diacylglycerol O-acyltransferase 1 [89-488]
Ligand
BDBM120755
Substrate
Meas. Tech.
Inhibition Assay
pH
7.5±n/a
Temperature
277.15±n/a K
IC50
8.5±n/a nM
Comments
extracted
Citation
 Forster, CJKwak, YNakajima, KWang, B Organic compounds US Patent  US8703761 Publication Date 4/22/2014 
Target
Name:
Diacylglycerol O-acyltransferase 1 [89-488]
Synonyms:
AGRP1 DGAT1 acyl coA-diacylglycerol acyl transferase 1 (DGAT1)
Type:
Protein
Mol. Mass.:
46366.89
Organism:
Homo sapiens (Human)
Description:
O75907[89-488]
Residue:
400
  
Inhibitor
Name:
BDBM120755
Synonyms:
US8703761, 1-8
Type:
Small organic molecule
Emp. Form.:
C28H27N3O3S
Mol. Mass.:
485.597
SMILES:
COc1ccccc1C(=O)NC(C)(C)C(=O)Nc1nc(c(Cc2ccccc2)s1)-c1ccccc1
: