Target
Diacylglycerol O-acyltransferase 1 [89-488]
Ligand
BDBM120762
Substrate
Meas. Tech.
Inhibition Assay
pH
7.5±n/a
Temperature
277.15±n/a K
IC50
2080±n/a nM
Comments
extracted
Citation
 Forster, CJKwak, YNakajima, KWang, B Organic compounds US Patent  US8703761 Publication Date 4/22/2014 
Target
Name:
Diacylglycerol O-acyltransferase 1 [89-488]
Synonyms:
AGRP1 DGAT1 acyl coA-diacylglycerol acyl transferase 1 (DGAT1)
Type:
Protein
Mol. Mass.:
46366.89
Organism:
Homo sapiens (Human)
Description:
O75907[89-488]
Residue:
400
  
Inhibitor
Name:
BDBM120762
Synonyms:
US8703761, 12-4
Type:
Small organic molecule
Emp. Form.:
C21H22F4N4O4S
Mol. Mass.:
502.482
SMILES:
CC(C)(NC(=O)N1CCCOCC1)C(=O)Nc1nc(c(s1)C(=O)c1ccc(F)cc1)C(F)(F)F
: