Target
RNA-editing ligase 1, mitochondrial
Ligand
BDBM64782
Substrate
Meas. Tech.
Fluorescence-based biochemical high throughput dose response assay to identify inhibitors of Trypanosoma brucei RNA editing ligase 1 (TbREL1).
IC50
>96559±n/a nM
Citation
 PubChem, PC Fluorescence-based biochemical high throughput dose response assay to identify inhibitors of Trypanosoma brucei RNA editing ligase 1 (TbREL1). PubChem Bioassay (2014)[AID] 
Target
Name:
RNA-editing ligase 1, mitochondrial
Synonyms:
REL1 Trypanosoma brucei RNA editing ligase 1
Type:
Enzyme Catalytic Domain
Mol. Mass.:
52299.36
Organism:
Trypanosoma brucei brucei
Description:
gi_342179211
Residue:
469
  
Inhibitor
Name:
BDBM64782
Synonyms:
(6E)-6-[[2-(2,6-dipyrrolidin-1-ylpyrimidin-4-yl)hydrazinyl]methylidene]cyclohexa-2,4-dien-1-one (6E)-6-[[[2,6-bis(1-pyrrolidinyl)-4-pyrimidinyl]hydrazo]methylidene]-1-cyclohexa-2,4-dienone MLS000577672 cid_6614484
Type:
Small organic molecule
Emp. Form.:
C19H24N6O
Mol. Mass.:
352.4335
SMILES:
Oc1ccccc1CN=Nc1cc(nc(n1)N1CCCC1)N1CCCC1
: