Target
RNA-editing ligase 1, mitochondrial
Ligand
BDBM50432
Substrate
Meas. Tech.
Fluorescence-based biochemical high throughput dose response assay to identify inhibitors of Trypanosoma brucei RNA editing ligase 1 (TbREL1).
IC50
>96559±n/a nM
Citation
 PubChem, PC Fluorescence-based biochemical high throughput dose response assay to identify inhibitors of Trypanosoma brucei RNA editing ligase 1 (TbREL1). PubChem Bioassay (2014)[AID] 
Target
Name:
RNA-editing ligase 1, mitochondrial
Synonyms:
REL1 Trypanosoma brucei RNA editing ligase 1
Type:
Enzyme Catalytic Domain
Mol. Mass.:
52299.36
Organism:
Trypanosoma brucei brucei
Description:
gi_342179211
Residue:
469
  
Inhibitor
Name:
BDBM50432
Synonyms:
2-[[5,6-bis(2-furanyl)-1,2,4-triazin-3-yl]thio]-1-phenylethanone 2-[[5,6-bis(furan-2-yl)-1,2,4-triazin-3-yl]sulfanyl]-1-phenyl-ethanone MLS000678010 cid_6403921
Type:
Small organic molecule
Emp. Form.:
C19H13N3O3S
Mol. Mass.:
363.39
SMILES:
O=C(CSc1nnc(-c2ccco2)c(n1)-c1ccco1)c1ccccc1
: