Target
RNA-editing ligase 1, mitochondrial
Ligand
BDBM52639
Substrate
Meas. Tech.
Fluorescence-based biochemical high throughput dose response assay to identify inhibitors of Trypanosoma brucei RNA editing ligase 1 (TbREL1).
IC50
34043±n/a nM
Citation
 PubChem, PC Fluorescence-based biochemical high throughput dose response assay to identify inhibitors of Trypanosoma brucei RNA editing ligase 1 (TbREL1). PubChem Bioassay (2014)[AID] 
Target
Name:
RNA-editing ligase 1, mitochondrial
Synonyms:
REL1 Trypanosoma brucei RNA editing ligase 1
Type:
Enzyme Catalytic Domain
Mol. Mass.:
52299.36
Organism:
Trypanosoma brucei brucei
Description:
gi_342179211
Residue:
469
  
Inhibitor
Name:
BDBM52639
Synonyms:
(1,3-dimethylbenzimidazol-3-ium-2-yl)-(4-morpholinophenyl)diazene;besylate SMR000283163 benzenesulfonate;(1,3-dimethylbenzimidazol-3-ium-2-yl)-(4-morpholin-4-ylphenyl)diazene | cid_15272053
Type:
Small organic molecule
Emp. Form.:
C19H22N5O
Mol. Mass.:
336.4103
SMILES:
Cn1c(\N=N\c2ccc(cc2)N2CCOCC2)[n+](C)c2ccccc12
: