Target
RNA-editing ligase 1, mitochondrial
Ligand
BDBM76207
Substrate
Meas. Tech.
Fluorescence-based biochemical high throughput dose response assay to identify inhibitors of Trypanosoma brucei RNA editing ligase 1 (TbREL1).
IC50
35544±n/a nM
Citation
 PubChem, PC Fluorescence-based biochemical high throughput dose response assay to identify inhibitors of Trypanosoma brucei RNA editing ligase 1 (TbREL1). PubChem Bioassay (2014)[AID] 
Target
Name:
RNA-editing ligase 1, mitochondrial
Synonyms:
REL1 Trypanosoma brucei RNA editing ligase 1
Type:
Enzyme Catalytic Domain
Mol. Mass.:
52299.36
Organism:
Trypanosoma brucei brucei
Description:
gi_342179211
Residue:
469
  
Inhibitor
Name:
BDBM76207
Synonyms:
2-(3-Cyano-7-hydroxy-5-oxo-4,5-dihydro-thieno[3,2-b]pyridin-2-ylsulfanyl)-N-thiazol-2-yl-acetamide 2-[(3-cyano-5-hydroxy-7-oxo-4H-thieno[3,2-b]pyridin-2-yl)sulfanyl]-N-(1,3-thiazol-2-yl)acetamide 2-[(3-cyano-5-oxidanyl-7-oxidanylidene-4H-thieno[3,2-b]pyridin-2-yl)sulfanyl]-N-(1,3-thiazol-2-yl)ethanamide MLS001222104 cid_54691675 | cid_6499471
Type:
Small organic molecule
Emp. Form.:
C13H8N4O3S3
Mol. Mass.:
364.423
SMILES:
Oc1cc(=O)[nH]c2c(C#N)c(SCC(=O)Nc3nccs3)sc12
: