Target
RNA-editing ligase 1, mitochondrial
Ligand
BDBM128149
Substrate
Meas. Tech.
Fluorescence-based biochemical high throughput dose response assay to identify inhibitors of Trypanosoma brucei RNA editing ligase 1 (TbREL1).
IC50
>96559±n/a nM
Citation
 PubChem, PC Fluorescence-based biochemical high throughput dose response assay to identify inhibitors of Trypanosoma brucei RNA editing ligase 1 (TbREL1). PubChem Bioassay (2014)[AID] 
Target
Name:
RNA-editing ligase 1, mitochondrial
Synonyms:
REL1 Trypanosoma brucei RNA editing ligase 1
Type:
Enzyme Catalytic Domain
Mol. Mass.:
52299.36
Organism:
Trypanosoma brucei brucei
Description:
gi_342179211
Residue:
469
  
Inhibitor
Name:
BDBM128149
Synonyms:
MLS002703109 [1-[(E)-cinnamyl]-2-methyl-imidazo[1,2-a]pyridin-4-ium-3-yl]-diphenyl-thioxo-phosphorane;bromide [2-methyl-1-[(E)-3-phenylprop-2-enyl]imidazo[1,2-a]pyridin-4-ium-3-yl]-diphenyl-sulfanylidene--phosphane;bromide | cid_46930969
Type:
Small organic molecule
Emp. Form.:
C29H26BrN2PS
Mol. Mass.:
545.473
SMILES:
[Br-].Cc1c([n+]2ccccc2n1C\C=C\c1ccccc1)P(=S)(c1ccccc1)c1ccccc1
: