Target
RNA-editing ligase 1, mitochondrial
Ligand
BDBM128159
Substrate
Meas. Tech.
Fluorescence-based biochemical high throughput dose response assay to identify inhibitors of Trypanosoma brucei RNA editing ligase 1 (TbREL1).
IC50
>96559±n/a nM
Citation
 PubChem, PC Fluorescence-based biochemical high throughput dose response assay to identify inhibitors of Trypanosoma brucei RNA editing ligase 1 (TbREL1). PubChem Bioassay (2014)[AID] 
Target
Name:
RNA-editing ligase 1, mitochondrial
Synonyms:
REL1 Trypanosoma brucei RNA editing ligase 1
Type:
Enzyme Catalytic Domain
Mol. Mass.:
52299.36
Organism:
Trypanosoma brucei brucei
Description:
gi_342179211
Residue:
469
  
Inhibitor
Name:
BDBM128159
Synonyms:
2-[(4-methoxyphenyl)methylamino]-6-methyl-4-[2-(trifluoromethyl)phenyl]-1-[[4-(trifluoromethyl)phenyl]methyl]-4H-pyrimidine-5-carboxylic acid methyl ester MLS003843148 cid_53316250 | methyl 2-[(4-methoxyphenyl)methylamino]-6-methyl-4-[2-(trifluoromethyl)phenyl]-1-[[4-(trifluoromethyl)phenyl]methyl]-4H-pyrimidine-5-carboxylate
Type:
Small organic molecule
Emp. Form.:
C30H27F6N3O3
Mol. Mass.:
591.5441
SMILES:
COC(=O)C1=C(C)N(Cc2ccc(cc2)C(F)(F)F)C(NCc2ccc(OC)cc2)=NC1c1ccccc1C(F)(F)F
: