Target
RNA-editing ligase 1, mitochondrial
Ligand
BDBM128162
Substrate
Meas. Tech.
Fluorescence-based biochemical high throughput dose response assay to identify inhibitors of Trypanosoma brucei RNA editing ligase 1 (TbREL1).
IC50
>96559±n/a nM
Citation
 PubChem, PC Fluorescence-based biochemical high throughput dose response assay to identify inhibitors of Trypanosoma brucei RNA editing ligase 1 (TbREL1). PubChem Bioassay (2014)[AID] 
Target
Name:
RNA-editing ligase 1, mitochondrial
Synonyms:
REL1 Trypanosoma brucei RNA editing ligase 1
Type:
Enzyme Catalytic Domain
Mol. Mass.:
52299.36
Organism:
Trypanosoma brucei brucei
Description:
gi_342179211
Residue:
469
  
Inhibitor
Name:
BDBM128162
Synonyms:
2-(cyclopropylmethylamino)-6-methyl-1-[3-(trifluoromethyl)benzyl]-4-[2-(trifluoromethyl)phenyl]-4H-pyrimidine-5-carboxylic acid methyl ester MLS003843151 cid_53316254 | methyl 2-(cyclopropylmethylamino)-6-methyl-4-[2-(trifluoromethyl)phenyl]-1-[[3-(trifluoromethyl)phenyl]methyl]-4H-pyrimidine-5-carboxylate
Type:
Small organic molecule
Emp. Form.:
C26H25F6N3O2
Mol. Mass.:
525.486
SMILES:
COC(=O)C1=C(C)N(Cc2cccc(c2)C(F)(F)F)C(NCC2CC2)=NC1c1ccccc1C(F)(F)F
: