Target
RNA-editing ligase 1, mitochondrial
Ligand
BDBM128171
Substrate
Meas. Tech.
Fluorescence-based biochemical high throughput dose response assay to identify inhibitors of Trypanosoma brucei RNA editing ligase 1 (TbREL1).
IC50
>96559±n/a nM
Citation
 PubChem, PC Fluorescence-based biochemical high throughput dose response assay to identify inhibitors of Trypanosoma brucei RNA editing ligase 1 (TbREL1). PubChem Bioassay (2014)[AID] 
Target
Name:
RNA-editing ligase 1, mitochondrial
Synonyms:
REL1 Trypanosoma brucei RNA editing ligase 1
Type:
Enzyme Catalytic Domain
Mol. Mass.:
52299.36
Organism:
Trypanosoma brucei brucei
Description:
gi_342179211
Residue:
469
  
Inhibitor
Name:
BDBM128171
Synonyms:
6-methyl-4-phenyl-1-[4-(trifluoromethyl)benzyl]-2-[[2-(trifluoromethyl)benzyl]amino]-4H-pyrimidine-5-carboxylic acid methyl ester MLS003843163 cid_53316262 | methyl 6-methyl-4-phenyl-1-[[4-(trifluoromethyl)phenyl]methyl]-2-[[2-(trifluoromethyl)phenyl]methylamino]-4H-pyrimidine-5-carboxylate
Type:
Small organic molecule
Emp. Form.:
C29H25F6N3O2
Mol. Mass.:
561.5181
SMILES:
COC(=O)C1=C(C)N(Cc2ccc(cc2)C(F)(F)F)C(NCc2ccccc2C(F)(F)F)=NC1c1ccccc1
: