Target
cAMP-specific 3',5'-cyclic phosphodiesterase 4B [122-736,S654A]
Ligand
BDBM285563
Substrate
Meas. Tech.
The PDE4A3, PDE4B1, PDE4C1 and PDE4D3 assays
IC50
6.99±n/a nM
Citation
 Chappie, TAPatel, NCHayward, MMHelal, CJSciabola, SLaChapelle, EAYoung, JMVerhoest, PR Imidazopyridazine compounds US Patent  US10077269 Publication Date 9/18/2018 
Target
Name:
cAMP-specific 3',5'-cyclic phosphodiesterase 4B [122-736,S654A]
Synonyms:
DPDE4 PDE4B1 cAMP-specific 3',5'-cyclic phosphodiesterase 4B
Type:
Enzyme Catalytic Domain
Mol. Mass.:
70253.85
Organism:
Homo sapiens (Human)
Description:
Q07343[122-736,S654A]
Residue:
615
  
Inhibitor
Name:
BDBM285563
Synonyms:
3-(3-chlorophenyl)-N-cyclopropylimidazo[1,2-b]pyridazine-2-carboxamide US10669279, Example 36 | US9598421, Example 36
Type:
Small organic molecule
Emp. Form.:
C16H13ClN4O
Mol. Mass.:
312.754
SMILES:
Clc1cccc(c1)-c1c(nc2cccnn12)C(=O)NC1CC1
: